Reaction Details
TargetATP-dependent translocase ABCB1
LigandBDBM50344942
Substrate/Competitorn/a
Meas. Tech.ChEMBL_148001 (CHEMBL754159)
IC50>35000±n/a nM
Citation Schwab, DFischer, HTabatabaei, APoli, SHuwyler, J Comparison of in vitro P-glycoprotein screening assays: recommendations for their use in drug discovery. J Med Chem46:1716-25 (2003) 
 
ATP-dependent translocase ABCB1
Name:ATP-dependent translocase ABCB1
Type:PROTEIN
Mol. Mass.:141009.67
Organism:Mus musculus
Description:ChEMBL_474396
Residue:1276
BDBM50344942
NameBDBM50344942
Synonyms:CHEMBL532 ERYTHROMYCIN Erycette Erythromycin A Ilotycin | T-Stat
TypeSmall organic molecule
Emp. Form.C37H67NO13
Mol. Mass.733.9268
SMILESCC[C@H]1OC(=O)[C@H](C)[C@@H](O[C@H]2C[C@@](C)(OC)[C@@H](O)[C@H](C)O2)[C@H](C)[C@@H](O[C@@H]2O[C@H](C)C[C@@H]([C@H]2O)N(C)C)[C@](C)(O)C[C@@H](C)C(=O)[C@H](C)[C@@H](O)[C@]1(C)O