Reaction Details
TargetATP-dependent translocase ABCB1
LigandBDBM50409816
Substrate/Competitorn/a
Meas. Tech.ChEMBL_148002 (CHEMBL754160)
IC50 200±n/a nM
Citation Schwab, DFischer, HTabatabaei, APoli, SHuwyler, J Comparison of in vitro P-glycoprotein screening assays: recommendations for their use in drug discovery. J Med Chem46:1716-25 (2003) 
 
ATP-dependent translocase ABCB1
Name:ATP-dependent translocase ABCB1
Type:Protein
Mol. Mass.:141503.50
Organism:Homo sapiens (Human)
Description:P08183
Residue:1280
BDBM50409816
NameBDBM50409816
Synonyms:ABAMECTIN
TypeSmall organic molecule
Emp. Form.C48H74O14
Mol. Mass.875.0928
SMILESCC[C@H](C)[C@H]1O[C@]2(CC[C@@H]1C)C[C@@H]1C[C@@H](C\C=C(C)\[C@@H](O[C@H]3C[C@H](OC)[C@@H](O[C@H]4C[C@H](OC)[C@@H](O)[C@H](C)O4)[C@H](C)O3)[C@@H](C)\C=C\C=C3/CO[C@@H]4[C@H](O)C(C)=C[C@@H](C(=O)O1)[C@]34O)O2