Reaction Details
TargetATP-dependent translocase ABCB1
LigandBDBM50367298
Substrate/Competitorn/a
Meas. Tech.ChEMBL_838261 (CHEMBL2076209)
IC50 2300±n/a nM
Citation Schwab, DFischer, HTabatabaei, APoli, SHuwyler, J Comparison of in vitro P-glycoprotein screening assays: recommendations for their use in drug discovery. J Med Chem46:1716-25 (2003) 
 
ATP-dependent translocase ABCB1
Name:ATP-dependent translocase ABCB1
Type:Protein
Mol. Mass.:141503.50
Organism:Homo sapiens (Human)
Description:P08183
Residue:1280
BDBM50367298
NameBDBM50367298
Synonyms:Cardene | NICARDIPINE
TypeSmall organic molecule
Emp. Form.C26H29N3O6
Mol. Mass.479.525
SMILESCOC(=O)C1C(C(C(=O)OCCN(C)Cc2ccccc2)=C(C)N=C1C)c1cccc(c1)[N+]([O-])=O