Reaction Details
TargetTransporter
LigandBDBM50175151
Substrate/Competitorn/a
Meas. Tech.ChEMBL_143110 (CHEMBL749359)
Ki 1420±n/a nM
Citation Kulkarni, SSGrundt, PKopajtic, TKatz, JLNewman, AH Structure-activity relationships at monoamine transporters for a series of N-substituted 3alpha-(bis[4-fluorophenyl]methoxy)tropanes: comparative molecular field analysis, synthesis, and pharmacological evaluation. J Med Chem47:3388-98 (2004) 
 
Transporter
Name:Transporter
Type:PROTEIN
Mol. Mass.:66787.87
Organism:Rattus norvegicus
Description:ChEMBL_1463061
Residue:597
BDBM50175151
NameBDBM50175151
Synonyms:3-(3-(bis(4-fluorophenyl)methoxy)-8-aza-bicyclo[3.2.1]octan-8-yl)-N-phenylpropanamide CHEMBL199004
TypeSmall organic molecule
Emp. Form.C29H30F2N2O2
Mol. Mass.476.5575
SMILESFc1ccc(cc1)C(OC1CC2CCC(C1)N2CCC(=O)Nc1ccccc1)c1ccc(F)cc1