Reaction Details
TargetSodium-dependent dopamine transporter
LigandBDBM50148746
Substrate/Competitorn/a
Meas. Tech.ChEMBL_62474 (CHEMBL677366)
Ki 26±n/a nM
Citation Kulkarni, SSGrundt, PKopajtic, TKatz, JLNewman, AH Structure-activity relationships at monoamine transporters for a series of N-substituted 3alpha-(bis[4-fluorophenyl]methoxy)tropanes: comparative molecular field analysis, synthesis, and pharmacological evaluation. J Med Chem47:3388-98 (2004) 
 
Sodium-dependent dopamine transporter
Name:Sodium-dependent dopamine transporter
Type:Multi-pass membrane protein
Mol. Mass.:68749.45
Organism:Rattus norvegicus (rat)
Description:P23977
Residue:619
BDBM50148746
NameBDBM50148746
Synonyms:4-{3-[Bis-(4-fluoro-phenyl)-methoxy]-8-aza-bicyclo[3.2.1]oct-8-yl}-butylamine | CHEMBL115311
TypeSmall organic molecule
Emp. Form.C24H30F2N2O
Mol. Mass.400.5046
SMILESNCCCCN1C2CCC1CC(C2)OC(c1ccc(F)cc1)c1ccc(F)cc1