Reaction Details
TargetSodium-dependent dopamine transporter
LigandBDBM50148744
Substrate/Competitorn/a
Meas. Tech.ChEMBL_62474 (CHEMBL677366)
Ki 13.1±n/a nM
Citation Kulkarni, SSGrundt, PKopajtic, TKatz, JLNewman, AH Structure-activity relationships at monoamine transporters for a series of N-substituted 3alpha-(bis[4-fluorophenyl]methoxy)tropanes: comparative molecular field analysis, synthesis, and pharmacological evaluation. J Med Chem47:3388-98 (2004) 
 
Sodium-dependent dopamine transporter
Name:Sodium-dependent dopamine transporter
Type:Multi-pass membrane protein
Mol. Mass.:68749.45
Organism:Rattus norvegicus (rat)
Description:P23977
Residue:619
BDBM50148744
NameBDBM50148744
Synonyms:CHEMBL115253 | N-(2-{3-[Bis-(4-fluoro-phenyl)-methoxy]-8-aza-bicyclo[3.2.1]oct-8-yl}-ethyl)-benzamide
TypeSmall organic molecule
Emp. Form.C29H30F2N2O2
Mol. Mass.476.5575
SMILESFc1ccc(cc1)C(OC1CC2CCC(C1)N2CCNC(=O)c1ccccc1)c1ccc(F)cc1