Reaction Details
TargetStromelysin-1
LigandBDBM50099857
Substrate/Competitorn/a
Meas. Tech.ChEMBL_104900 (CHEMBL713436)
Kd 17000000±n/a nM
Citation Erlanson, DAMcDowell, RSO'Brien, T Fragment-based drug discovery. J Med Chem47:3463-82 (2004) 
 
Stromelysin-1
Name:Stromelysin-1
Type:Enzyme
Mol. Mass.:53973.13
Organism:Homo sapiens (Human)
Description: P08254
Residue:477
BDBM50099857
NameBDBM50099857
Synonyms:ACETOHYDROXAMIC ACID (AHA) Acethydroxamsaeure Acetic acid, oxime Cetohyroxamic acid Methylhydroxamic acid N-Acetylhydroxylamine acetohydroxamic acid
TypeSmall organic molecule
Emp. Form.C2H5NO2
Mol. Mass.75.0666
SMILESCC(=O)NO