Reaction Details
TargetAdenosine kinase
LigandBDBM50094703
Substrate/Competitorn/a
Meas. Tech.ChEMBL_31130 (CHEMBL643558)
IC50 1.7±n/a nM
Citation Erlanson, DAMcDowell, RSO'Brien, T Fragment-based drug discovery. J Med Chem47:3463-82 (2004) 
 
Adenosine kinase
Name:Adenosine kinase
Type:PROTEIN
Mol. Mass.:40545.97
Organism:Homo sapiens (Human)
Description:ChEMBL_1467841
Residue:362
BDBM50094703
NameBDBM50094703
Synonyms:5-(3-Bromo-phenyl)-7-(6-morpholin-4-yl-pyridin-3-yl)-pyrido[2,3-d]pyrimidin-4-ylamine ABT-702 | CHEMBL66089
TypeSmall organic molecule
Emp. Form.C22H19BrN6O
Mol. Mass.463.33
SMILESNc1ncnc2nc(cc(-c3cccc(Br)c3)c12)-c1ccc(nc1)N1CCOCC1