Reaction Details
TargetInterstitial collagenase
LigandBDBM50149234
Substrate/Competitorn/a
Meas. Tech.ChEMBL_106306 (CHEMBL714561)
IC50>10000±n/a nM
Citation Erlanson, DAMcDowell, RSO'Brien, T Fragment-based drug discovery. J Med Chem47:3463-82 (2004) 
 
Interstitial collagenase
Name:Interstitial collagenase
Type:Enzyme
Mol. Mass.:54010.26
Organism:Homo sapiens (Human)
Description: P03956
Residue:469
BDBM50149234
NameBDBM50149234
Synonyms:Benzofuran-2-carboxylic acid (4-morpholin-4-yl-butyl)-amide N-(4-morpholinobutyl)benzofuran-2-carboxamide
TypeSmall organic molecule
Emp. Form.C17H22N2O3
Mol. Mass.302.3682
SMILESO=C(NCCCCN1CCOCC1)c1cc2ccccc2o1