Reaction Details
TargetAdenosine receptor A2b
LigandBDBM50150076
Substrate/Competitorn/a
Meas. Tech.ChEMBL_31079 (CHEMBL640610)
EC50 9±n/a nM
Citation Beukers, MWChang, LCvon Frijtag Drabbe Künzel, JKMulder-Krieger, TSpanjersberg, RFBrussee, JIJzerman, AP New, non-adenosine, high-potency agonists for the human adenosine A2B receptor with an improved selectivity profile compared to the reference agonist N-ethylcarboxamidoadenosine. J Med Chem47:3707-9 (2004) 
 
Adenosine receptor A2b
Name:Adenosine receptor A2b
Type:G Protein-Coupled Receptor (GPCR)
Mol. Mass.:36341.22
Organism:Homo sapiens (Human)
Description:n/a
Residue:332
BDBM50150076
NameBDBM50150076
Synonyms:2-((1H-imidazol-2-yl)methylthio)-6-amino-4-(4-methoxyphenyl)pyridine-3,5-dicarbonitrile CHEMBL122396
TypeSmall organic molecule
Emp. Form.C18H14N6OS
Mol. Mass.362.408
SMILESCOc1ccc(cc1)-c1c(C#N)c(N)nc(SCc2ncc[nH]2)c1C#N