Reaction Details
TargetSodium-dependent dopamine transporter
LigandBDBM50138642
Substrate/Competitorn/a
Meas. Tech.ChEMBL_62010 (CHEMBL671632)
IC50 0.77±n/a nM
Citation Carroll, FIPawlush, NKuhar, MJPollard, GTHoward, JL Synthesis, monoamine transporter binding properties, and behavioral pharmacology of a series of 3beta-(substituted phenyl)-2beta-(3'-substituted isoxazol-5-yl)tropanes. J Med Chem47:296-302 (2004) 
 
Sodium-dependent dopamine transporter
Name:Sodium-dependent dopamine transporter
Type:Multi-pass membrane protein
Mol. Mass.:68749.45
Organism:Rattus norvegicus (rat)
Description:P23977
Residue:619
BDBM50138642
NameBDBM50138642
Synonyms:3-(4-Chloro-phenyl)-2-isoxazol-5-yl-8-methyl-8-aza-bicyclo[3.2.1]octane | CHEMBL103523
TypeSmall organic molecule
Emp. Form.C17H19ClN2O
Mol. Mass.302.799
SMILESCN1C2CCC1C(C(C2)c1ccc(Cl)cc1)c1ccno1