Reaction Details
TargetProtein kinase C alpha type
LigandBDBM50085889
Substrate/Competitorn/a
Meas. Tech.ChEMBL_160295 (CHEMBL769623)
Ki 2.3±n/a nM
Citation Tamamura, HSigano, DMLewin, NEBlumberg, PMMarquez, VE Conformationally constrained analogues of diacylglycerol. 20. The search for an elusive binding site on protein kinase C through relocation of the carbonyl pharmacophore along the sn-1 side chain of 1,2-diacylglycerol lactones. J Med Chem47:644-55 (2004) 
 
Protein kinase C alpha type
Name:Protein kinase C alpha type
Type:Enzyme
Mol. Mass.:76755.65
Organism:Homo sapiens (Human)
Description:The recombinant human PKC enzymes were produced using a baculovirus expression system in SF9 cells
Residue:672
BDBM50085889
NameBDBM50085889
Synonyms:CHEMBL111625 Decanoic acid 2-hydroxymethyl-4-[3-isopropyl-4-methyl-pent-(Z)-ylidene]-5-oxo-tetrahydro-furan-2-ylmethyl ester
TypeSmall organic molecule
Emp. Form.C25H44O5
Mol. Mass.424.6139
SMILESCCCCCCCCCC(=O)OCC1(CO)C\C(=C\CC(C(C)C)C(C)C)C(=O)O1