Reaction Details
TargetAdenosine deaminase
LigandBDBM50367032
Substrate/Competitorn/a
Meas. Tech.ChEMBL_30790 (CHEMBL645067)
Ki 0.01±n/a nM
Citation Reayi, AHosmane, RS Inhibition of adenosine deaminase by novel 5:7 fused heterocycles containing the imidazo[4,5-e][1,2,4]triazepine ring system: a structure-activity relationship study. J Med Chem47:1044-50 (2004) 
 
Adenosine deaminase
Name:Adenosine deaminase
Type:Enzyme
Mol. Mass.:40910.44
Organism:Bos taurus (bovine)
Description:n/a
Residue:363
BDBM50367032
NameBDBM50367032
Synonyms:COFORMYCIN
TypeSmall organic molecule
Emp. Form.C11H16N4O5
Mol. Mass.284.2685
SMILESOC[C@H]1O[C@H]([C@H](O)[C@@H]1O)n1cnc2[C@H](O)CNC=Nc12