Reaction Details
TargetVoltage-dependent L-type calcium channel subunit alpha-1C/alpha-1D/alpha-1S
LigandBDBM50453799
Substrate/Competitorn/a
Meas. Tech.ChEMBL_92779 (CHEMBL700079)
Ki 4.6±n/a nM
Citation Wermuth, CG Selective optimization of side activities: another way for drug discovery. J Med Chem47:1303-14 (2004) 
 
Voltage-dependent L-type calcium channel subunit alpha-1C/alpha-1D/alpha-1S
Name:Voltage-dependent L-type calcium channel subunit alpha-1C/alpha-1D/alpha-1S
Synonyms:Voltage-gated L-type calcium channel
Type:n/a
Mol. Mass.:n/a
Description:ASSAY_ID of ChEMBL is 92765
Components:This complex has 3 components.
Component 1
Name:Voltage-dependent L-type calcium channel subunit alpha-1D
Type:PROTEIN
Mol. Mass.:250148.41
Organism:Rattus norvegicus
Description:ChEMBL_44709
Residue:2203
Component 2
Name:Voltage-dependent L-type calcium channel subunit alpha-1C
Synonyms:CAC1C_RAT Cacn2 Cacnl1a1 Calcium channel (Type L) Calcium channel, L type, alpha-1 polypeptide, isoform 1, cardiac muscle RBC Voltage-dependent L-type calcium channel subunit alpha-1C Voltage-gated L-type calcium channel alpha-1C subunit | Voltage-gated calcium channel subunit alpha Cav1.2
Type:Enzyme Catalytic Domain
Mol. Mass.:243492.26
Organism:RAT
Description:Calcium channel 0 RAT::P22002
Residue:2169
Component 3
Name:Voltage-dependent L-type calcium channel subunit alpha-1S
Synonyms:CAC1S_RAT Cacn1 Cacnl1a3 Cchl1a3 Voltage-gated L-type calcium channel Voltage-gated calcium channel subunit alpha Cav1.1
Type:PROTEIN
Mol. Mass.:210392.58
Organism:Rattus norvegicus
Description:ChEMBL_92777
Residue:1850
BDBM50453799
NameBDBM50453799
Synonyms:Niguldipine
TypeSmall organic molecule
Emp. Form.C36H39N3O6
Mol. Mass.609.7114
SMILESCOC(=O)C1=C(C)NC(C)=C([C@H]1c1cccc(c1)[N+]([O-])=O)C(=O)OCCCN1CCC(CC1)(c1ccccc1)c1ccccc1