Reaction Details
Target5-hydroxytryptamine receptor 2A
LigandBDBM35255
Substrate/Competitorn/a
Meas. Tech.ChEMBL_2298 (CHEMBL617083)
Ki 0.910000±n/a nM
Citation Wermuth, CG Selective optimization of side activities: another way for drug discovery. J Med Chem47:1303-14 (2004) 
 
5-hydroxytryptamine receptor 2A
Name:5-hydroxytryptamine receptor 2A
Type:undefined
Mol. Mass.:52607.65
Organism:Homo sapiens (Human)
Description:P28223
Residue:471
BDBM35255
NameBDBM35255
Synonyms:2-Chlor-11-(2-dimethylaminoaethoxy)-dibenzo(b,f)-thiepin 2-[(8-chlorodibenzo[b,f]thiepin-10-yl)oxy]-N,N-dimethylethanamine Nipolept zotepine
TypeSmall organic molecule
Emp. Form.C18H18ClNOS
Mol. Mass.331.86
SMILESCN(C)CCOC1=Cc2ccccc2Sc2ccc(Cl)cc12