Reaction Details
TargetEndothelin-1 receptor
LigandBDBM50091105
Substrate/Competitorn/a
Meas. Tech.ChEMBL_63504 (CHEMBL676594)
Ki 1.4±n/a nM
Citation Wermuth, CG Selective optimization of side activities: another way for drug discovery. J Med Chem47:1303-14 (2004) 
 
Endothelin-1 receptor
Name:Endothelin-1 receptor
Type:Enzyme Catalytic Domain
Mol. Mass.:48736.88
Organism:Homo sapiens (Human)
Description:P25101
Residue:427
BDBM50091105
NameBDBM50091105
Synonyms:4''-Oxazol-2-yl-biphenyl-2-sulfonic acid (3,4-dimethyl-isoxazol-5-yl)-amide 4'-Oxazol-2-yl-biphenyl-2-sulfonicacid(3,4-dimethyl-isoxazol-5-yl)-amide CHEMBL24461
TypeSmall organic molecule
Emp. Form.C20H17N3O4S
Mol. Mass.395.432
SMILESCc1noc(NS(=O)(=O)c2ccccc2-c2ccc(cc2)-c2ncco2)c1C