Reaction Details
TargetHistamine H1 receptor
LigandBDBM50095890
Substrate/Competitorn/a
Meas. Tech.ChEMBL_84427 (CHEMBL691615)
Ki 19±n/a nM
Citation Wermuth, CG Selective optimization of side activities: another way for drug discovery. J Med Chem47:1303-14 (2004) 
 
Histamine H1 receptor
Name:Histamine H1 receptor
Type:G Protein-Coupled Receptor (GPCR)
Mol. Mass.:55808.72
Organism:Homo sapiens (Human)
Description:Cell pellets from SK-N-MC cells transfected with human H1 receptor were used in binding assay.
Residue:487
BDBM50095890
NameBDBM50095890
Synonyms:2-[2-(4-Dibenzo[b,f][1,4]thiazepin-11-yl-1-piperazinyl)ethoxy]ethanol CHEMBL716 | QUETIAPINE
TypeSmall organic molecule
Emp. Form.C21H25N3O2S
Mol. Mass.383.507
SMILESOCCOCCN1CCN(CC1)C1=Nc2ccccc2Sc2ccccc12