Reaction Details
TargetSodium channel protein type 4 subunit alpha
LigandBDBM50141071
Substrate/Competitorn/a
Meas. Tech.ChEMBL_202570 (CHEMBL805351)
Ki 340±n/a nM
Citation Yang, JGharagozloo, PYao, JIlyin, VICarter, RBNguyen, PRobledo, SWoodward, RMHogenkamp, DJ 3-(4-phenoxyphenyl)pyrazoles: a novel class of sodium channel blockers. J Med Chem47:1547-52 (2004) 
 
Sodium channel protein type 4 subunit alpha
Name:Sodium channel protein type 4 subunit alpha
Type:Protein
Mol. Mass.:208010.01
Organism:Homo sapiens (Human)
Description:P35499
Residue:1836
BDBM50141071
NameBDBM50141071
Synonyms:3-[4-(4-Fluoro-phenoxy)-phenyl]-pyrazole-1-carboxylic acid dimethylamide | CHEMBL289421
TypeSmall organic molecule
Emp. Form.C18H16FN3O2
Mol. Mass.325.3369
SMILESCN(C)C(=O)n1ccc(n1)-c1ccc(Oc2ccc(F)cc2)cc1