Reaction Details
TargetSodium channel protein type 4 subunit alpha
LigandBDBM50141072
Substrate/Competitorn/a
Meas. Tech.ChEMBL_202570 (CHEMBL805351)
Ki 35±n/a nM
Citation Yang, JGharagozloo, PYao, JIlyin, VICarter, RBNguyen, PRobledo, SWoodward, RMHogenkamp, DJ 3-(4-phenoxyphenyl)pyrazoles: a novel class of sodium channel blockers. J Med Chem47:1547-52 (2004) 
 
Sodium channel protein type 4 subunit alpha
Name:Sodium channel protein type 4 subunit alpha
Type:Protein
Mol. Mass.:208010.01
Organism:Homo sapiens (Human)
Description:P35499
Residue:1836
BDBM50141072
NameBDBM50141072
Synonyms:3-(4-Phenoxy-phenyl)-pyrazole-1-carboxylic acid amide | CHEMBL37263
TypeSmall organic molecule
Emp. Form.C16H13N3O2
Mol. Mass.279.2933
SMILESNC(=O)n1ccc(n1)-c1ccc(Oc2ccccc2)cc1