Reaction Details
TargetDimer of Protein farnesyltransferase subunit beta
LigandBDBM50143597
Substrate/Competitorn/a
Meas. Tech.ChEMBL_70593 (CHEMBL681330)
Ki 1±n/a nM
Citation Bell, IM Inhibitors of farnesyltransferase: a rational approach to cancer chemotherapy? J Med Chem47:1869-78 (2004) 
 
Dimer of Protein farnesyltransferase subunit beta
Name:Dimer of Protein farnesyltransferase subunit beta
Synonyms:Protein Farnesyltransferase (PFT) Chain B
Type:n/a
Mol. Mass.:n/a
Description:ASSAY_ID of EBI is 51428
Components:This complex has 3 components.
Component 1
Name:Protein farnesyltransferase subunit beta
Type:Enzyme Subunit
Mol. Mass.:48766.02
Organism:Homo sapiens (Human)
Description:Protein farnesyltransferase subunit beta
Residue:437
Component 2
Name:Protein farnesyltransferase subunit beta
Synonyms:CAAX farnesyltransferase subunit alpha FNTB FTase-alpha GGTase-I-alpha Protein farnesyl/geranylgeranyl transferase Protein farnesyltransferase subunit beta Protein farnesyltransferase/geranylgeranyltransferase type-1 subunit alpha Ras proteins prenyltransferase subunit beta | Type I protein geranyl-geranyltransferase subunit alpha
Type:Enzyme Subunit
Mol. Mass.:48766.02
Organism:Homo sapiens (Human)
Description:Protein farnesyltransferase subunit beta
Residue:437
BDBM50143597
NameBDBM50143597
Synonyms:(S)-2-(2-[2-(4-Fluoro-phenyl)-ethyl]-5-{[(1S,4S)-4-(pyridine-3-carbonylsulfanyl)-pyrrolidin-2-ylmethyl]-amino}-benzoylamino)-4-methylsulfanyl-butyric acid isopropyl ester | CHEMBL53670
TypeSmall organic molecule
Emp. Form.C34H41FN4O4S2
Mol. Mass.652.842
SMILESCSCC[C@H](NC(=O)c1cc(NC[C@@H]2C[C@@H](CN2)SC(=O)c2cccnc2)ccc1CCc1ccc(F)cc1)C(=O)OC(C)C