Reaction Details
TargetGeranylgeranyl transferase type-1 subunit beta/Protein farnesyltransferase/geranylgeranyltransferase type-1 subunit alpha
LigandBDBM50143597
Substrate/Competitorn/a
Meas. Tech.ChEMBL_71964 (CHEMBL686129)
Ki 8±n/a nM
Citation Bell, IM Inhibitors of farnesyltransferase: a rational approach to cancer chemotherapy? J Med Chem47:1869-78 (2004) 
 
Geranylgeranyl transferase type-1 subunit beta/Protein farnesyltransferase/geranylgeranyltransferase type-1 subunit alpha
Name:Geranylgeranyl transferase type-1 subunit beta/Protein farnesyltransferase/geranylgeranyltransferase type-1 subunit alpha
Type:n/a
Mol. Mass.:n/a
Description:ASSAY_ID of EBI is 70196
Components:This complex has 2 components.
Component 1
Name:Protein farnesyltransferase/geranylgeranyltransferase type-1 subunit alpha
Synonyms:CAAX farnesyltransferase alpha subunit FNTA_HUMAN FTase-alpha Geranylgeranyl Transferase (GGTase-I) Chain A Protein Farnesyltransferase (PFT) Chain A Protein farnesyltransferase Protein farnesyltransferase/geranylgeranyltransferase type I alpha subunit | Ras proteins prenyltransferase alpha
Type:Enzyme
Mol. Mass.:44392.46
Organism:Homo sapiens (Human)
Description:Recombinant human FTase.
Residue:379
Component 2
Name:Geranylgeranyl transferase type-1 subunit beta
Synonyms:2.5.1.59 Geranylgeranyl transferase type I Geranylgeranyl transferase type I subunit beta PGGT1B Protein farnesyl/geranylgeranyl transferase | Type I protein geranyl-geranyltransferase subunit beta
Type:n/a
Mol. Mass.:42369.84
Organism:Homo sapiens (Human)
Description:n/a
Residue:377
BDBM50143597
NameBDBM50143597
Synonyms:(S)-2-(2-[2-(4-Fluoro-phenyl)-ethyl]-5-{[(1S,4S)-4-(pyridine-3-carbonylsulfanyl)-pyrrolidin-2-ylmethyl]-amino}-benzoylamino)-4-methylsulfanyl-butyric acid isopropyl ester | CHEMBL53670
TypeSmall organic molecule
Emp. Form.C34H41FN4O4S2
Mol. Mass.652.842
SMILESCSCC[C@H](NC(=O)c1cc(NC[C@@H]2C[C@@H](CN2)SC(=O)c2cccnc2)ccc1CCc1ccc(F)cc1)C(=O)OC(C)C