Reaction Details
TargetDelta-type opioid receptor
LigandBDBM50143608
Substrate/Competitorn/a
Meas. Tech.ChEMBL_145190 (CHEMBL754435)
Ki 1100±n/a nM
Citation Zhang, AXiong, WHilbert, JEDeVita, EKBidlack, JMNeumeyer, JL 2-aminothiazole-derived opioids. Bioisosteric replacement of phenols. J Med Chem47:1886-8 (2004) 
 
Delta-type opioid receptor
Name:Delta-type opioid receptor
Type:G Protein-Coupled Receptor (GPCR)
Mol. Mass.:40382.98
Organism:Homo sapiens (Human)
Description:Competition binding assays were carried out using membrane preparations from transfected HN9.10 cells that constitutively expressed the delta opioid receptor.
Residue:372
BDBM50143608
NameBDBM50143608
Synonyms:20-methyl-(1R,12R)-7-thia-5,20-diazapentacyclo[10.5.3.01,13.02,10.04,8]icosa-2(10),3,5,8-tetraen-6-amine | CHEMBL56360
TypeSmall organic molecule
Emp. Form.C18H23N3S
Mol. Mass.313.46
SMILESCN1CC[C@]23CCCCC2[C@H]1Cc1cc2sc(N)nc2cc31