Reaction Details
TargetDelta-type opioid receptor
LigandBDBM50105483
Substrate/Competitorn/a
Meas. Tech.ChEMBL_145190 (CHEMBL754435)
Ki 1.9±n/a nM
Citation Zhang, AXiong, WHilbert, JEDeVita, EKBidlack, JMNeumeyer, JL 2-aminothiazole-derived opioids. Bioisosteric replacement of phenols. J Med Chem47:1886-8 (2004) 
 
Delta-type opioid receptor
Name:Delta-type opioid receptor
Type:G Protein-Coupled Receptor (GPCR)
Mol. Mass.:40382.98
Organism:Homo sapiens (Human)
Description:Competition binding assays were carried out using membrane preparations from transfected HN9.10 cells that constitutively expressed the delta opioid receptor.
Residue:372
BDBM50105483
NameBDBM50105483
Synonyms:(-)-cyclorphan 17-cyclopropylmethyl-(9R)-17-azatetracyclo[7.5.3.01,10.02,7]heptadeca-2(7),3,5-trien-4-ol CHEMBL291468
TypeSmall organic molecule
Emp. Form.C20H27NO
Mol. Mass.297.4345
SMILESOc1ccc2C[C@@H]3C4CCCC[C@]4(CCN3CC3CC3)c2c1