Reaction Details
TargetKappa-type opioid receptor
LigandBDBM50143611
Substrate/Competitorn/a
Meas. Tech.ChEMBL_147223 (CHEMBL754911)
Ki 0.490000±n/a nM
Citation Zhang, AXiong, WHilbert, JEDeVita, EKBidlack, JMNeumeyer, JL 2-aminothiazole-derived opioids. Bioisosteric replacement of phenols. J Med Chem47:1886-8 (2004) 
 
Kappa-type opioid receptor
Name:Kappa-type opioid receptor
Type:G Protein-Coupled Receptor (GPCR)
Mol. Mass.:42648.76
Organism:Homo sapiens (Human)
Description:P41145
Residue:380
BDBM50143611
NameBDBM50143611
Synonyms:13-cyclobutylmethyl-1,16-dimethyl-(1R,12R,16R)-7-thia-5,13-diazatetracyclo[10.3.1.02,10.04,8]hexadeca-2(10),3,5,8-tetraen-6-amine | CHEMBL301701
TypeSmall organic molecule
Emp. Form.C20H27N3S
Mol. Mass.341.513
SMILESC[C@H]1[C@H]2Cc3cc4sc(N)nc4cc3[C@]1(C)CCN2CC1CCC1