Reaction Details
TargetAdenosine receptor A2b
LigandBDBM50144902
Substrate/Competitorn/a
Meas. Tech.ChEMBL_30420 (CHEMBL645974)
Ki>10000±n/a nM
Citation Kehraus, SGorzalka, SHallmen, CIqbal, JMüller, CEWright, ADWiese, MKönig, GM Novel amino acid derived natural products from the ascidian Atriolum robustum: identification and pharmacological characterization of a unique adenosine derivative. J Med Chem47:2243-55 (2004) 
 
Adenosine receptor A2b
Name:Adenosine receptor A2b
Type:G Protein-Coupled Receptor (GPCR)
Mol. Mass.:36341.22
Organism:Homo sapiens (Human)
Description:n/a
Residue:332
BDBM50144902
NameBDBM50144902
Synonyms:3-(4-Hydroxy-phenyl)-2-methoxy-acrylic acid (3S,5R)-2-(6-amino-purin-9-yl)-4-(3-1H-imidazol-4-yl-acryloyloxy)-5-((S)-(R)-methylsulfanylmethyl)-tetrahydro-furan-3-yl ester | CHEMBL72613
TypeSmall organic molecule
Emp. Form.C27H27N7O7S
Mol. Mass.593.611
SMILESCOC(=Cc1ccc(O)cc1)C(=O)O[C@@H]1[C@H](OC(=O)C=Cc2cnc[nH]2)[C@@H](CSC)O[C@H]1n1cnc2c(N)ncnc12