Reaction Details
TargetAdenosine receptor A3
LigandBDBM22111
Substrate/Competitorn/a
Meas. Tech.ChEMBL_31552 (CHEMBL644503)
IC50 71000±n/a nM
Citation Kehraus, SGorzalka, SHallmen, CIqbal, JMüller, CEWright, ADWiese, MKönig, GM Novel amino acid derived natural products from the ascidian Atriolum robustum: identification and pharmacological characterization of a unique adenosine derivative. J Med Chem47:2243-55 (2004) 
 
Adenosine receptor A3
Name:Adenosine receptor A3
Type:G Protein-Coupled Receptor (GPCR)
Mol. Mass.:36197.32
Organism:Homo sapiens (Human)
Description:P0DMS8
Residue:318
BDBM22111
NameBDBM22111
Synonyms:(2R,3R,4S,5S)-2-(6-amino-9H-purin-9-yl)-5-[(methylsulfanyl)methyl]oxolane-3,4-diol 5'-Methylthioado CHEMBL277041 | MTA
TypeNucleoside or nucleotide
Emp. Form.C11H15N5O3S
Mol. Mass.297.334
SMILESCSC[C@H]1O[C@H]([C@H](O)[C@@H]1O)n1cnc2c(N)ncnc12