Reaction Details
TargetVasopressin V1b receptor
LigandBDBM50145118
Substrate/Competitorn/a
Meas. Tech.ChEMBL_214687 (CHEMBL817650)
Ki 0.29±n/a nM
Citation Cheng, LLStoev, SManning, MDerick, SPena, AMimoun, MBGuillon, G Design of potent and selective agonists for the human vasopressin V1b receptor based on modifications of [deamino-cys1]arginine vasopressin at position 4. J Med Chem47:2375-88 (2004) 
 
Vasopressin V1b receptor
Name:Vasopressin V1b receptor
Type:Enzyme
Mol. Mass.:46985.01
Organism:Homo sapiens (Human)
Description:P47901
Residue:424
BDBM50145118
NameBDBM50145118
Synonyms:CHEMBL412353 | d[Val4]AVP
TypeSmall organic molecule
Emp. Form.C46H65N13O11S2
Mol. Mass.1040.219
SMILESCC(C)[C@@H]1NC(=O)[C@@H](Cc2ccccc2)NC(=O)[C@H](Cc2ccc(O)cc2)NC(=O)CCSSC[C@@H](NC(=O)[C@@H](CC(N)=O)NC1=O)C(=O)N1CCC[C@@H]1C(=O)N[C@@H](CCCNC(N)=N)C(=O)NCC(N)=O