Reaction Details
TargetThymidine kinase, cytosolic
LigandBDBM50135088
Substrate/Competitorn/a
Meas. Tech.ChEMBL_208002 (CHEMBL816084)
Ki 85800±n/a nM
Citation Russ, PSchelling, PScapozza, LFolkers, GClercq, EDMarquez, VE Synthesis and biological evaluation of 5-substituted derivatives of the potent antiherpes agent (north)-methanocarbathymine. J Med Chem46:5045-54 (2003) 
 
Thymidine kinase, cytosolic
Name:Thymidine kinase, cytosolic
Type:PROTEIN
Mol. Mass.:25476.50
Organism:Homo sapiens (Human)
Description:ChEMBL_1333884
Residue:234
BDBM50135088
NameBDBM50135088
Synonyms:(1S,2S,4S,5R)-1-[4-Hydroxy-5-(hydroxymethyl)bicyclo-[3.1.0]hex-2-yl]-5-iodo-1,3-dihydropyrimidine-2,4-dione 1-((1S,2S,4S,5R)-4-Hydroxy-5-hydroxymethyl-bicyclo[3.1.0]hex-2-yl)-5-iodo-1H-pyrimidine-2,4-dione | CHEMBL344107
TypeSmall organic molecule
Emp. Form.C11H13IN2O4
Mol. Mass.364.1364
SMILESOC[C@@]12C[C@@H]1[C@H](C[C@@H]2O)n1cc(I)c(=O)[nH]c1=O