Reaction Details
TargetProthrombin
LigandBDBM50147790
Substrate/Competitorn/a
Meas. Tech.ChEMBL_208532 (CHEMBL813626)
Ki 0.45±n/a nM
Citation Young, MBBarrow, JCGlass, KLLundell, GFNewton, CLPellicore, JMRittle, KESelnick, HGStauffer, KJVacca, JPWilliams, PDBohn, DClayton, FCCook, JJKrueger, JAKuo, LCLewis, SDLucas, BJMcMasters, DRMiller-Stein, CPietrak, BLWallace, AAWhite, RBWong, BYan, YNantermet, PG Discovery and evaluation of potent P1 aryl heterocycle-based thrombin inhibitors. J Med Chem47:2995-3008 (2004) 
 
Prothrombin
Name:Prothrombin
Type:Protein
Mol. Mass.:70029.57
Organism:Homo sapiens (Human)
Description:P00734
Residue:622
BDBM50147790
NameBDBM50147790
Synonyms:2-[6-Chloro-3-(2,2-difluoro-2-pyridin-2-yl-ethylamino)-2-oxo-2H-pyrazin-1-yl]-N-(2-[1,2,4]triazol-1-yl-benzyl)-acetamide | CHEMBL102866
TypeSmall organic molecule
Emp. Form.C22H19ClF2N8O2
Mol. Mass.500.888
SMILESFC(F)(CNc1ncc(Cl)n(CC(=O)NCc2ccccc2-n2cncn2)c1=O)c1ccccn1