Reaction Details
TargetProthrombin
LigandBDBM50147795
Substrate/Competitorn/a
Meas. Tech.ChEMBL_208532 (CHEMBL813626)
Ki 7.3±n/a nM
Citation Young, MBBarrow, JCGlass, KLLundell, GFNewton, CLPellicore, JMRittle, KESelnick, HGStauffer, KJVacca, JPWilliams, PDBohn, DClayton, FCCook, JJKrueger, JAKuo, LCLewis, SDLucas, BJMcMasters, DRMiller-Stein, CPietrak, BLWallace, AAWhite, RBWong, BYan, YNantermet, PG Discovery and evaluation of potent P1 aryl heterocycle-based thrombin inhibitors. J Med Chem47:2995-3008 (2004) 
 
Prothrombin
Name:Prothrombin
Type:Protein
Mol. Mass.:70029.57
Organism:Homo sapiens (Human)
Description:P00734
Residue:622
BDBM50147795
NameBDBM50147795
Synonyms:2-(6-Methyl-2-oxo-3-phenylmethanesulfonylamino-2H-pyridin-1-yl)-N-(2-[1,2,4]triazol-1-yl-benzyl)-acetamide | CHEMBL103648
TypeSmall organic molecule
Emp. Form.C24H24N6O4S
Mol. Mass.492.55
SMILESCc1ccc(NS(=O)(=O)Cc2ccccc2)c(=O)n1CC(=O)NCc1ccccc1-n1cncn1