Reaction Details
TargetProthrombin
LigandBDBM50147820
Substrate/Competitorn/a
Meas. Tech.ChEMBL_208532 (CHEMBL813626)
Ki 0.440±n/a nM
Citation Young, MBBarrow, JCGlass, KLLundell, GFNewton, CLPellicore, JMRittle, KESelnick, HGStauffer, KJVacca, JPWilliams, PDBohn, DClayton, FCCook, JJKrueger, JAKuo, LCLewis, SDLucas, BJMcMasters, DRMiller-Stein, CPietrak, BLWallace, AAWhite, RBWong, BYan, YNantermet, PG Discovery and evaluation of potent P1 aryl heterocycle-based thrombin inhibitors. J Med Chem47:2995-3008 (2004) 
 
Prothrombin
Name:Prothrombin
Type:Protein
Mol. Mass.:70029.57
Organism:Homo sapiens (Human)
Description:P00734
Residue:622
BDBM50147820
NameBDBM50147820
Synonyms:CHEMBL102174 | N-(3-Chloro-benzyl)-2-[6-chloro-3-(2,2-difluoro-2-pyridin-2-yl-ethylamino)-2-oxo-2H-pyrazin-1-yl]-acetamide
TypeSmall organic molecule
Emp. Form.C20H17Cl2F2N5O2
Mol. Mass.468.284
SMILESFC(F)(CNc1ncc(Cl)n(CC(=O)NCc2cccc(Cl)c2)c1=O)c1ccccn1