Reaction Details
TargetInterleukin-2 receptor subunit alpha
LigandBDBM50147971
Substrate/Competitorn/a
Meas. Tech.ChEMBL_89085 (CHEMBL698595)
IC50 1000000±n/a nM
Citation Raimundo, BCOslob, JDBraisted, ACHyde, JMcDowell, RSRandal, MWaal, NDWilkinson, JYu, CHArkin, MR Integrating fragment assembly and biophysical methods in the chemical advancement of small-molecule antagonists of IL-2: an approach for inhibiting protein-protein interactions. J Med Chem47:3111-30 (2004) 
 
Interleukin-2 receptor subunit alpha
Name:Interleukin-2 receptor subunit alpha
Type:PROTEIN
Mol. Mass.:30733.96
Organism:Mus musculus
Description:ChEMBL_89085
Residue:268
BDBM50147971
NameBDBM50147971
Synonyms:(S)-2-{2-[(1-Carbamimidoyl-pyrrolidine-2-carbonyl)-amino]-acetylamino}-3-(4-phenylethynyl-phenyl)-propionic acid methyl ester | CHEMBL320692
TypeSmall organic molecule
Emp. Form.C26H29N5O4
Mol. Mass.475.5396
SMILESCOC(=O)[C@H](Cc1ccc(cc1)C#Cc1ccccc1)NC(=O)CNC(=O)[C@H]1CCCN1C(N)=N