Reaction Details
TargetInterleukin-2 receptor subunit alpha
LigandBDBM50147973
Substrate/Competitorn/a
Meas. Tech.ChEMBL_89084 (CHEMBL878448)
IC50 10000±n/a nM
Citation Raimundo, BCOslob, JDBraisted, ACHyde, JMcDowell, RSRandal, MWaal, NDWilkinson, JYu, CHArkin, MR Integrating fragment assembly and biophysical methods in the chemical advancement of small-molecule antagonists of IL-2: an approach for inhibiting protein-protein interactions. J Med Chem47:3111-30 (2004) 
 
Interleukin-2 receptor subunit alpha
Name:Interleukin-2 receptor subunit alpha
Type:PROTEIN
Mol. Mass.:30733.96
Organism:Mus musculus
Description:ChEMBL_89085
Residue:268
BDBM50147973
NameBDBM50147973
Synonyms:2-(R)-Cyclohexyl-N-(2-{4-[5-(2,4-dichloro-phenyl)-2H-pyrazol-3-yl]-piperidin-1-yl}-2-oxo-ethyl)-2-guanidino-acetamide | CHEMBL106518
TypeSmall organic molecule
Emp. Form.C25H33Cl2N7O2
Mol. Mass.534.481
SMILESNC(N)=N[C@H](C1CCCCC1)C(=O)NCC(=O)N1CCC(CC1)c1cc(n[nH]1)-c1ccc(Cl)cc1Cl