Reaction Details
TargetInterleukin-2 receptor subunit alpha
LigandBDBM50147974
Substrate/Competitorn/a
Meas. Tech.ChEMBL_89083 (CHEMBL698594)
IC50 6000±n/a nM
Citation Raimundo, BCOslob, JDBraisted, ACHyde, JMcDowell, RSRandal, MWaal, NDWilkinson, JYu, CHArkin, MR Integrating fragment assembly and biophysical methods in the chemical advancement of small-molecule antagonists of IL-2: an approach for inhibiting protein-protein interactions. J Med Chem47:3111-30 (2004) 
 
Interleukin-2 receptor subunit alpha
Name:Interleukin-2 receptor subunit alpha
Type:PROTEIN
Mol. Mass.:30733.96
Organism:Mus musculus
Description:ChEMBL_89085
Residue:268
BDBM50147974
NameBDBM50147974
Synonyms:(S)-2-[2-((R)-1-Carbamimidoyl-piperidin-3-yl)-acetylamino]-3-(4-phenylethynyl-phenyl)-propionic acid methyl ester CHEMBL419362
TypeSmall organic molecule
Emp. Form.C26H30N4O3
Mol. Mass.446.5414
SMILESCOC(=O)[C@H](Cc1ccc(cc1)C#Cc1ccccc1)NC(=O)C[C@H]1CCCN(C1)C(N)=N