Reaction Details
TargetInterleukin-2 receptor subunit alpha
LigandBDBM50229786
Substrate/Competitorn/a
Meas. Tech.ChEMBL_89084 (CHEMBL878448)
IC50 60±n/a nM
Citation Raimundo, BCOslob, JDBraisted, ACHyde, JMcDowell, RSRandal, MWaal, NDWilkinson, JYu, CHArkin, MR Integrating fragment assembly and biophysical methods in the chemical advancement of small-molecule antagonists of IL-2: an approach for inhibiting protein-protein interactions. J Med Chem47:3111-30 (2004) 
 
Interleukin-2 receptor subunit alpha
Name:Interleukin-2 receptor subunit alpha
Type:PROTEIN
Mol. Mass.:30733.96
Organism:Mus musculus
Description:ChEMBL_89085
Residue:268
BDBM50229786
NameBDBM50229786
Synonyms:5-[2,3-DICHLORO-4-(5-{1-[2-(2-GUANIDINO-4-METHYL-PENTANOYLAMINO)-ACETYL]-PIPERIDIN-4-YL}-1-METHYL-1H-PYRAZOL-3-YL)-PHENOXYMETHYL]-FURAN-2-CARBOXYLIC ACID 5-[2,3-Dichloro-4-(5-{1-[2-((R)-2-guanidino-4-methyl-pentanoylamino)-acetyl]-piperidin-4-yl}-1-methyl-1H-pyrazol-3-yl)-phenoxymethyl]-furan-2-carboxylic acid SP-4206
TypeSmall organic molecule
Emp. Form.C30H37Cl2N7O6
Mol. Mass.662.564
SMILES[#6]-[#6](-[#6])-[#6]-[#6](\[#7+]=[#6](\[#7])-[#7])-[#6](=O)-[#7]-[#6]-[#6](=O)-[#7]-1-[#6]-[#6]-[#6](-[#6]-[#6]-1)-c1cc(nn1-[#6])-c1ccc(-[#8]-[#6]-c2ccc(o2)-[#6](-[#8-])=O)c(Cl)c1Cl