Reaction Details
TargetInterleukin-2 receptor subunit alpha
LigandBDBM50147983
Substrate/Competitorn/a
Meas. Tech.ChEMBL_89084 (CHEMBL878448)
IC50 400000±n/a nM
Citation Raimundo, BCOslob, JDBraisted, ACHyde, JMcDowell, RSRandal, MWaal, NDWilkinson, JYu, CHArkin, MR Integrating fragment assembly and biophysical methods in the chemical advancement of small-molecule antagonists of IL-2: an approach for inhibiting protein-protein interactions. J Med Chem47:3111-30 (2004) 
 
Interleukin-2 receptor subunit alpha
Name:Interleukin-2 receptor subunit alpha
Type:PROTEIN
Mol. Mass.:30733.96
Organism:Mus musculus
Description:ChEMBL_89085
Residue:268
BDBM50147983
NameBDBM50147983
Synonyms:2-Cyclohexyl-N-(2-{4-[5-(2,3-dichloro-phenyl)-4-methyl-4H-pyrazol-3-yl]-piperidin-1-yl}-2-oxo-ethyl)-2-guanidino-acetamide | CHEMBL105251
TypeSmall organic molecule
Emp. Form.C26H35Cl2N7O2
Mol. Mass.548.508
SMILESCc1c([nH]nc1-c1cccc(Cl)c1Cl)C1CCN(CC1)C(=O)CNC(=O)[C@H](N=C(N)N)C1CCCCC1