Reaction Details
TargetInterleukin-2 receptor subunit alpha
LigandBDBM50147984
Substrate/Competitorn/a
Meas. Tech.ChEMBL_89084 (CHEMBL878448)
IC50 35000±n/a nM
Citation Raimundo, BCOslob, JDBraisted, ACHyde, JMcDowell, RSRandal, MWaal, NDWilkinson, JYu, CHArkin, MR Integrating fragment assembly and biophysical methods in the chemical advancement of small-molecule antagonists of IL-2: an approach for inhibiting protein-protein interactions. J Med Chem47:3111-30 (2004) 
 
Interleukin-2 receptor subunit alpha
Name:Interleukin-2 receptor subunit alpha
Type:PROTEIN
Mol. Mass.:30733.96
Organism:Mus musculus
Description:ChEMBL_89085
Residue:268
BDBM50147984
NameBDBM50147984
Synonyms:2-Guanidino-4-methyl-pentanoic acid (2-{4-[5-(4-benzyloxy-2,3-dichloro-phenyl)-2-methyl-2H-pyrazol-3-yl]-piperidin-1-yl}-2-oxo-ethyl)-amide | CHEMBL265306
TypeSmall organic molecule
Emp. Form.C31H39Cl2N7O3
Mol. Mass.628.592
SMILES[#6]-[#6](-[#6])-[#6]-[#6@@H](\[#7]=[#6](/[#7])-[#7])-[#6](=O)-[#7]-[#6]-[#6](=O)-[#7]-1-[#6]-[#6]-[#6](-[#6]-[#6]-1)-c1cc(nn1-[#6])-c1ccc(-[#8]-[#6]-c2ccccc2)c(Cl)c1Cl