Reaction Details
TargetInterleukin-2 receptor subunit alpha
LigandBDBM50147993
Substrate/Competitorn/a
Meas. Tech.ChEMBL_89084 (CHEMBL878448)
IC50 150000±n/a nM
Citation Raimundo, BCOslob, JDBraisted, ACHyde, JMcDowell, RSRandal, MWaal, NDWilkinson, JYu, CHArkin, MR Integrating fragment assembly and biophysical methods in the chemical advancement of small-molecule antagonists of IL-2: an approach for inhibiting protein-protein interactions. J Med Chem47:3111-30 (2004) 
 
Interleukin-2 receptor subunit alpha
Name:Interleukin-2 receptor subunit alpha
Type:PROTEIN
Mol. Mass.:30733.96
Organism:Mus musculus
Description:ChEMBL_89085
Residue:268
BDBM50147993
NameBDBM50147993
Synonyms:2-Cyclohexyl-N-{2-[4-(2',4'-dichloro-biphenyl-3-yl)-piperidin-1-yl]-2-oxo-ethyl}-2-guanidino-acetamide | CHEMBL105518
TypeSmall organic molecule
Emp. Form.C28H35Cl2N5O2
Mol. Mass.544.516
SMILES[#7]\[#6](-[#7])=[#7]/[#6@H](-[#6]-1-[#6]-[#6]-[#6]-[#6]-[#6]-1)-[#6](=O)-[#7]-[#6]-[#6](=O)-[#7]-1-[#6]-[#6]-[#6](-[#6]-[#6]-1)-c1cccc(c1)-c1ccc(Cl)cc1Cl