Reaction Details
TargetInterleukin-2 receptor subunit alpha
LigandBDBM50147999
Substrate/Competitorn/a
Meas. Tech.ChEMBL_89085 (CHEMBL698595)
IC50 9000±n/a nM
Citation Raimundo, BCOslob, JDBraisted, ACHyde, JMcDowell, RSRandal, MWaal, NDWilkinson, JYu, CHArkin, MR Integrating fragment assembly and biophysical methods in the chemical advancement of small-molecule antagonists of IL-2: an approach for inhibiting protein-protein interactions. J Med Chem47:3111-30 (2004) 
 
Interleukin-2 receptor subunit alpha
Name:Interleukin-2 receptor subunit alpha
Type:PROTEIN
Mol. Mass.:30733.96
Organism:Mus musculus
Description:ChEMBL_89085
Residue:268
BDBM50147999
NameBDBM50147999
Synonyms:(S)-2-[2-((S)-2-Guanidino-3,3-dimethyl-butyrylamino)-acetylamino]-3-(4-phenylethynyl-phenyl)-propionic acid methyl ester | CHEMBL317898
TypeSmall organic molecule
Emp. Form.C27H33N5O4
Mol. Mass.491.582
SMILES[#6]-[#8]-[#6](=O)-[#6@H](-[#6]-c1ccc(cc1)C#Cc1ccccc1)-[#7]-[#6](=O)-[#6]-[#7]-[#6](=O)-[#6@@H](\[#7]=[#6](/[#7])-[#7])C([#6])([#6])[#6]