Reaction Details
TargetInterleukin-2 receptor subunit alpha
LigandBDBM50147998
Substrate/Competitorn/a
Meas. Tech.ChEMBL_89084 (CHEMBL878448)
IC50 50000±n/a nM
Citation Raimundo, BCOslob, JDBraisted, ACHyde, JMcDowell, RSRandal, MWaal, NDWilkinson, JYu, CHArkin, MR Integrating fragment assembly and biophysical methods in the chemical advancement of small-molecule antagonists of IL-2: an approach for inhibiting protein-protein interactions. J Med Chem47:3111-30 (2004) 
 
Interleukin-2 receptor subunit alpha
Name:Interleukin-2 receptor subunit alpha
Type:PROTEIN
Mol. Mass.:30733.96
Organism:Mus musculus
Description:ChEMBL_89085
Residue:268
BDBM50147998
NameBDBM50147998
Synonyms:2-(R)-Cyclohexyl-2-guanidino-N-{2-oxo-2-[4-(5-o-tolyl-2H-pyrazol-3-yl)-piperidin-1-yl]-ethyl}-acetamide | CHEMBL104791
TypeSmall organic molecule
Emp. Form.C26H37N7O2
Mol. Mass.479.6177
SMILESCc1ccccc1-c1cc([nH]n1)C1CCN(CC1)C(=O)CNC(=O)[C@H](N=C(N)N)C1CCCCC1