Reaction Details
TargetInterleukin-2 receptor subunit alpha
LigandBDBM50148003
Substrate/Competitorn/a
Meas. Tech.ChEMBL_89084 (CHEMBL878448)
IC50 40000±n/a nM
Citation Raimundo, BCOslob, JDBraisted, ACHyde, JMcDowell, RSRandal, MWaal, NDWilkinson, JYu, CHArkin, MR Integrating fragment assembly and biophysical methods in the chemical advancement of small-molecule antagonists of IL-2: an approach for inhibiting protein-protein interactions. J Med Chem47:3111-30 (2004) 
 
Interleukin-2 receptor subunit alpha
Name:Interleukin-2 receptor subunit alpha
Type:PROTEIN
Mol. Mass.:30733.96
Organism:Mus musculus
Description:ChEMBL_89085
Residue:268
BDBM50148003
NameBDBM50148003
Synonyms:4-[2,3-Dichloro-4-(5-{1-[2-((R)-2-guanidino-4-methyl-1-oxo-pentylamino)-acetyl]-piperidin-4-yl}-1-methyl-1H-pyrazol-3-yl)-phenoxymethyl]-benzoic acid methyl ester | CHEMBL104914
TypeSmall organic molecule
Emp. Form.C33H41Cl2N7O5
Mol. Mass.686.629
SMILES[#6]-[#8]-[#6](=O)-c1ccc(-[#6]-[#8]-c2ccc(-c3cc(-[#6]-4-[#6]-[#6]-[#7](-[#6]-[#6]-4)-[#6](=O)-[#6]-[#7]-[#6](=O)-[#6@@H](-[#6]-[#6](-[#6])-[#6])\[#7]=[#6](/[#7])-[#7])n(-[#6])n3)c(Cl)c2Cl)cc1