Reaction Details
TargetInterleukin-2 receptor subunit alpha
LigandBDBM50148005
Substrate/Competitorn/a
Meas. Tech.ChEMBL_89085 (CHEMBL698595)
IC50 1200000±n/a nM
Citation Raimundo, BCOslob, JDBraisted, ACHyde, JMcDowell, RSRandal, MWaal, NDWilkinson, JYu, CHArkin, MR Integrating fragment assembly and biophysical methods in the chemical advancement of small-molecule antagonists of IL-2: an approach for inhibiting protein-protein interactions. J Med Chem47:3111-30 (2004) 
 
Interleukin-2 receptor subunit alpha
Name:Interleukin-2 receptor subunit alpha
Type:PROTEIN
Mol. Mass.:30733.96
Organism:Mus musculus
Description:ChEMBL_89085
Residue:268
BDBM50148005
NameBDBM50148005
Synonyms:(S)-2-{2-[2-(N-Methyl-guanidino)-acetylamino]-acetylamino}-3-(4-phenylethynyl-phenyl)-propionic acid methyl ester | CHEMBL104059
TypeSmall organic molecule
Emp. Form.C24H27N5O4
Mol. Mass.449.5023
SMILESCOC(=O)[C@H](Cc1ccc(cc1)C#Cc1ccccc1)NC(=O)CNC(=O)CN(C)C(N)=N