Reaction Details
TargetInterleukin-2 receptor subunit alpha
LigandBDBM50148007
Substrate/Competitorn/a
Meas. Tech.ChEMBL_89083 (CHEMBL698594)
IC50 2200000±n/a nM
Citation Raimundo, BCOslob, JDBraisted, ACHyde, JMcDowell, RSRandal, MWaal, NDWilkinson, JYu, CHArkin, MR Integrating fragment assembly and biophysical methods in the chemical advancement of small-molecule antagonists of IL-2: an approach for inhibiting protein-protein interactions. J Med Chem47:3111-30 (2004) 
 
Interleukin-2 receptor subunit alpha
Name:Interleukin-2 receptor subunit alpha
Type:PROTEIN
Mol. Mass.:30733.96
Organism:Mus musculus
Description:ChEMBL_89085
Residue:268
BDBM50148007
NameBDBM50148007
Synonyms:(S)-2-(2-Methoxy-acetylamino)-3-(4-phenylethynyl-phenyl)-propionic acid | CHEMBL105741
TypeSmall organic molecule
Emp. Form.C20H19NO4
Mol. Mass.337.3692
SMILESCOCC(=O)N[C@@H](Cc1ccc(cc1)C#Cc1ccccc1)C(O)=O