Reaction Details
TargetInterleukin-2 receptor subunit alpha
LigandBDBM50148004
Substrate/Competitorn/a
Meas. Tech.ChEMBL_89084 (CHEMBL878448)
IC50 400±n/a nM
Citation Raimundo, BCOslob, JDBraisted, ACHyde, JMcDowell, RSRandal, MWaal, NDWilkinson, JYu, CHArkin, MR Integrating fragment assembly and biophysical methods in the chemical advancement of small-molecule antagonists of IL-2: an approach for inhibiting protein-protein interactions. J Med Chem47:3111-30 (2004) 
 
Interleukin-2 receptor subunit alpha
Name:Interleukin-2 receptor subunit alpha
Type:PROTEIN
Mol. Mass.:30733.96
Organism:Mus musculus
Description:ChEMBL_89085
Residue:268
BDBM50148004
NameBDBM50148004
Synonyms:3-[2,3-Dichloro-4-(5-{1-[2-((R)-2-guanidino-4-methyl-1-oxo-pentylamino)-acetyl]-piperidin-4-yl}-1-methyl-1H-pyrazol-3-yl)-phenoxymethyl]-benzoic acid | CHEMBL108123
TypeSmall organic molecule
Emp. Form.C32H39Cl2N7O5
Mol. Mass.672.602
SMILES[#6]-[#6](-[#6])-[#6]-[#6@@H](\[#7]=[#6](/[#7])-[#7])-[#6](=O)-[#7]-[#6]-[#6](=O)-[#7]-1-[#6]-[#6]-[#6](-[#6]-[#6]-1)-c1cc(nn1-[#6])-c1ccc(-[#8]-[#6]-c2cccc(c2)-[#6](-[#8])=O)c(Cl)c1Cl