Reaction Details
TargetProstaglandin E2 receptor EP2 subtype
LigandBDBM50150971
Substrate/Competitorn/a
Meas. Tech.ChEMBL_302496 (CHEMBL875211)
Ki 8900±n/a nM
Citation Torisu, KKobayashi, KIwahashi, MEgashira, HNakai, YOkada, YNanbu, FOhuchida, SNakai, HToda, M Discovery of new chemical leads for prostaglandin D2 receptor antagonists. Bioorg Med Chem Lett14:4557-62 (2004) 
 
Prostaglandin E2 receptor EP2 subtype
Name:Prostaglandin E2 receptor EP2 subtype
Type:G-protein coupled receptor
Mol. Mass.:40495.26
Organism:Mus musculus (Mouse)
Description:n/a
Residue:362
BDBM50150971
NameBDBM50150971
Synonyms:1-(4-Butoxy-benzoyl)-5-methoxy-1H-indole-3-carboxylic acid | CHEMBL185087
TypeSmall organic molecule
Emp. Form.C21H21NO5
Mol. Mass.367.3951
SMILESCCCCOc1ccc(cc1)C(=O)n1cc(C(O)=O)c2cc(OC)ccc12