Reaction Details
TargetProstaglandin E2 receptor EP3 subtype
LigandBDBM50150973
Substrate/Competitorn/a
Meas. Tech.ChEMBL_302497 (CHEMBL828213)
Ki>10000±n/a nM
Citation Torisu, KKobayashi, KIwahashi, MEgashira, HNakai, YOkada, YNanbu, FOhuchida, SNakai, HToda, M Discovery of new chemical leads for prostaglandin D2 receptor antagonists. Bioorg Med Chem Lett14:4557-62 (2004) 
 
Prostaglandin E2 receptor EP3 subtype
Name:Prostaglandin E2 receptor EP3 subtype
Type:G-protein coupled receptor
Mol. Mass.:40092.50
Organism:Mus musculus (Mouse)
Description:n/a
Residue:365
BDBM50150973
NameBDBM50150973
Synonyms:CHEMBL362541 | [1-(4-Butoxy-benzoyl)-5-methoxy-2-methyl-1H-indol-3-yl]-acetic acid
TypeSmall organic molecule
Emp. Form.C23H25NO5
Mol. Mass.395.4483
SMILESCCCCOc1ccc(cc1)C(=O)n1c(C)c(CC(O)=O)c2cc(OC)ccc12