Reaction Details
TargetProstaglandin D2 receptor
LigandBDBM50150966
Substrate/Competitorn/a
Meas. Tech.ChEMBL_302469 (CHEMBL826334)
Ki 110±n/a nM
Citation Torisu, KKobayashi, KIwahashi, MEgashira, HNakai, YOkada, YNanbu, FOhuchida, SNakai, HToda, M Discovery of new chemical leads for prostaglandin D2 receptor antagonists. Bioorg Med Chem Lett14:4557-62 (2004) 
 
Prostaglandin D2 receptor
Name:Prostaglandin D2 receptor
Type:PROTEIN
Mol. Mass.:40018.63
Organism:Mus musculus
Description:ChEMBL_788408
Residue:357
BDBM50150966
NameBDBM50150966
Synonyms:CHEMBL182572 | [1-(4-Butoxy-benzoyl)-2-methyl-1H-indol-3-yl]-acetic acid
TypeSmall organic molecule
Emp. Form.C22H23NO4
Mol. Mass.365.4223
SMILESCCCCOc1ccc(cc1)C(=O)n1c(C)c(CC(O)=O)c2ccccc12