Reaction Details
TargetCarbonic anhydrase
LigandBDBM26979
Substrate/Competitorn/a
Meas. Tech.ChEMBL_302990 (CHEMBL830229)
Ki 152000000±n/a nM
Citation Innocenti, AZimmerman, SFerry, JGScozzafava, ASupuran, CT Carbonic anhydrase inhibitors. Inhibition of the beta-class enzyme from the methanoarchaeon Methanobacterium thermoautotrophicum (Cab) with anions. Bioorg Med Chem Lett14:4563-7 (2004) 
 
Carbonic anhydrase
Name:Carbonic anhydrase
Synonyms:n/a
Type:PROTEIN
Mol. Mass.:19556.84
Organism:Methanobacterium thermoautotrophicum
Description:ChEMBL_1280426
Residue:176
BDBM26979
NameBDBM26979
TypeIon
Emp. Form.Cl
Mol. Mass.35.454
SMILES[Cl-]