Reaction Details
TargetPotassium voltage-gated channel subfamily H member 2
LigandBDBM35938
Substrate/Competitorn/a
Meas. Tech.ChEMBL_304914 (CHEMBL827807)
IC50 1100±n/a nM
Citation Du, LPTsai, KCLi, MYYou, QDXia, L The pharmacophore hypotheses of I(Kr) potassium channel blockers: novel class III antiarrhythmic agents. Bioorg Med Chem Lett14:4771-7 (2004) 
 
Potassium voltage-gated channel subfamily H member 2
Name:Potassium voltage-gated channel subfamily H member 2
Type:Multi-pass membrane protein
Mol. Mass.:126672.65
Organism:Homo sapiens (Human)
Description:Q12809
Residue:1159
BDBM35938
NameBDBM35938
Synonyms:1-(p-chlorophenyl)-1-(2-pyridyl)-3-N,N-dimethylpropylamine 3-(p-chlorophenyl)-3-(2-pyridyl)-N,N-dimethylpropylamine CHEMBL505 CHLORPHENIRAMINE MALEATE Polaramine [3H]Chlorphenamine chlorophenylpyridamine clorfeniramina gamma-(4-chlorophenyl)-N,N-dimethyl-2-pyridinepropanamine | gamma-(4-chlorophenyl)-gamma-(2-pyridyl)propyldimethylamine
Typeradiolabeled ligand
Emp. Form.C16H19ClN2
Mol. Mass.274.788
SMILESCN(C)CCC(c1ccc(Cl)cc1)c1ccccn1