Reaction Details
TargetPotassium voltage-gated channel subfamily H member 2
LigandBDBM50131442
Substrate/Competitorn/a
Meas. Tech.ChEMBL_304914 (CHEMBL827807)
IC50 30±n/a nM
Citation Du, LPTsai, KCLi, MYYou, QDXia, L The pharmacophore hypotheses of I(Kr) potassium channel blockers: novel class III antiarrhythmic agents. Bioorg Med Chem Lett14:4771-7 (2004) 
 
Potassium voltage-gated channel subfamily H member 2
Name:Potassium voltage-gated channel subfamily H member 2
Type:Multi-pass membrane protein
Mol. Mass.:126672.65
Organism:Homo sapiens (Human)
Description:Q12809
Residue:1159
BDBM50131442
NameBDBM50131442
Synonyms:(S)-1-(2-(chroman-4-yl)ethyl)-4-(3,4-dimethoxyphenyl)piperidine CHEMBL96153 | RP-58866
TypeSmall organic molecule
Emp. Form.C24H31NO3
Mol. Mass.381.5078
SMILESCOc1ccc(cc1OC)C1CCN(CC[C@H]2CCOc3ccccc23)CC1